Reaction Details
TargetOxysterols receptor LXR-alpha
LigandBDBM19993
Substrate/Competitorn/a
Meas. Tech.ChEMBL_340909 (CHEMBL860635)
EC50 10±n/a nM
Citation Li, LLiu, JZhu, LCutler, SHasegawa, HShan, BMedina, JC Discovery and optimization of a novel series of liver X receptor-alpha agonists. Bioorg Med Chem Lett16:1638-42 (2006) 
 
Oxysterols receptor LXR-alpha
Name:Oxysterols receptor LXR-alpha
Type:Enzyme Catalytic Domain
Mol. Mass.:50403.85
Organism:Homo sapiens (Human)
Description:Q13133
Residue:447
BDBM19993
NameBDBM19993
Synonyms:CHEMBL62136 T 0901317 TO-901317 US10669296, Compound TO901317 [3H]T0901317
TypeSmall organic molecule
Emp. Form.C17H12F9NO3S
Mol. Mass.481.333
SMILESOC(c1ccc(cc1)N(CC(F)(F)F)S(=O)(=O)c1ccccc1)(C(F)(F)F)C(F)(F)F