Reaction Details
TargetVascular endothelial growth factor receptor 2
LigandBDBM50179890
Substrate/Competitorn/a
Meas. Tech.ChEMBL_340948 (CHEMBL866514)
IC50 75±n/a nM
Citation Duncton, MAPiatnitski, ELKatoch-Rouse, RSmith, LMKiselyov, ASMilligan, DLBalagtas, CWong, WCKawakami, JDoody, JF Arylphthalazines. Part 2: 1-(Isoquinolin-5-yl)-4-arylamino phthalazines as potent inhibitors of VEGF receptors I and II. Bioorg Med Chem Lett16:1579-81 (2006) 
 
Vascular endothelial growth factor receptor 2
Name:Vascular endothelial growth factor receptor 2
Type:Receptor Tyrosine Kinase
Mol. Mass.:151510.97
Organism:Homo sapiens (Human)
Description:P35968
Residue:1356
BDBM50179890
NameBDBM50179890
Synonyms:(4-tert-Butylphenyl)-(4-isoquinolin-5-yl-phthalazin-1-yl)amine N-(4-tert-butylphenyl)-4-(isoquinolin-5-yl)phthalazin-1-amine
TypeSmall organic molecule
Emp. Form.C27H24N4
Mol. Mass.404.5063
SMILESCC(C)(C)c1ccc(Nc2nnc(-c3cccc4cnccc34)c3ccccc23)cc1