Reaction Details
TargetGABA-A receptor; alpha-5/beta-3/gamma-2
LigandBDBM50179924
Substrate/Competitorn/a
Meas. Tech.ChEMBL_340231 (CHEMBL862572)
Ki 0.14±n/a nM
Citation Jennings, ASLewis, RTRussell, MGHallett, DJStreet, LJCastro, JLAtack, JRCook, SMLincoln, RStanley, JSmith, AJReynolds, DSSohal, BPike, AMarshall, GRWafford, KASheppard, WFTye, SJ Imidazo[1,2-b][1,2,4]triazines as alpha2/alpha3 subtype selective GABA A agonists for the treatment of anxiety. Bioorg Med Chem Lett16:1477-80 (2006) 
 
GABA-A receptor; alpha-5/beta-3/gamma-2
Name:GABA-A receptor; alpha-5/beta-3/gamma-2
Type:n/a
Mol. Mass.:n/a
Description:ASSAY_ID of ChEMBL is 2148177
Components:This complex has 3 components.
Component 1
Name:Gamma-aminobutyric acid receptor subunit gamma-2
Synonyms:GABA(A) receptor subunit gamma-2 GBRG2_HUMAN
Type:PROTEIN
Mol. Mass.:54172.74
Organism:Homo sapiens (Human)
Description:EBI_217
Residue:467
Component 2
Name:Gamma-aminobutyric acid receptor subunit beta-3
Synonyms:GABA A receptor alpha-4/beta-3/gamma-2 GABA-A receptor GBRB3_HUMAN | agonist GABA site
Type:PROTEIN
Mol. Mass.:54130.51
Organism:Homo sapiens (Human)
Description:ChEMBL_448071
Residue:473
Component 3
Name:Gamma-aminobutyric acid receptor subunit alpha-5
Synonyms:GABA receptor alpha-5 subunit GABRA5 Gamma-aminobutyric acid receptor subunit alpha-5 (GABA(A)) | Gamma-aminobutyric acid receptor subunit alpha-5 (GABAA)
Type:Enzyme
Mol. Mass.:52160.59
Organism:Homo sapiens (Human)
Description:P31644
Residue:462
BDBM50179924
NameBDBM50179924
Synonyms:4-(2-fluoro-5-(7-(2-hydroxypropan-2-yl)imidazo[1,2-a]pyrimidin-3-yl)phenyl)nicotinonitrile | CHEMBL383677
TypeSmall organic molecule
Emp. Form.C21H16FN5O
Mol. Mass.373.383
SMILESCC(C)(O)c1ccn2c(cnc2n1)-c1ccc(F)c(c1)-c1ccncc1C#N