Reaction Details
Target17-beta-hydroxysteroid dehydrogenase type 3
LigandBDBM50179959
Substrate/Competitorn/a
Meas. Tech.ChEMBL_340362 (CHEMBL864403)
IC50 170±n/a nM
Citation Fink, BEGavai, AVTokarski, JSGoyal, BMisra, RXiao, HYKimball, SDHan, WCNorris, DSpires, TEYou, DGottardis, MMLorenzi, MVVite, GD Identification of a novel series of tetrahydrodibenzazocines as inhibitors of 17beta-hydroxysteroid dehydrogenase type 3. Bioorg Med Chem Lett16:1532-6 (2006) 
 
17-beta-hydroxysteroid dehydrogenase type 3
Name:17-beta-hydroxysteroid dehydrogenase type 3
Type:Enzyme
Mol. Mass.:34525.39
Organism:Homo sapiens (Human)
Description:P37058
Residue:310
BDBM50179959
NameBDBM50179959
Synonyms:1-(2-chloro-6,11-dihydro-5-thia-12-aza-dibenzo[a,e]cycloocten-12-yl)-ethanone | CHEMBL202967
TypeSmall organic molecule
Emp. Form.C16H14ClNOS
Mol. Mass.303.806
SMILESCC(=O)N1Cc2ccccc2CSc2ccc(Cl)cc12