Reaction Details
Target17-beta-hydroxysteroid dehydrogenase type 3
LigandBDBM50179934
Substrate/Competitorn/a
Meas. Tech.ChEMBL_340362 (CHEMBL864403)
IC50 19±n/a nM
Citation Fink, BEGavai, AVTokarski, JSGoyal, BMisra, RXiao, HYKimball, SDHan, WCNorris, DSpires, TEYou, DGottardis, MMLorenzi, MVVite, GD Identification of a novel series of tetrahydrodibenzazocines as inhibitors of 17beta-hydroxysteroid dehydrogenase type 3. Bioorg Med Chem Lett16:1532-6 (2006) 
 
17-beta-hydroxysteroid dehydrogenase type 3
Name:17-beta-hydroxysteroid dehydrogenase type 3
Type:Enzyme
Mol. Mass.:34525.39
Organism:Homo sapiens (Human)
Description:P37058
Residue:310
BDBM50179934
NameBDBM50179934
Synonyms:4-(5-acetyl-2-chloro-5,6,11,12-tetrahydro-dibenzo[b,f]azocin-8-yl)-benzonitrile | CHEMBL204349
TypeSmall organic molecule
Emp. Form.C24H19ClN2O
Mol. Mass.386.873
SMILESCC(=O)N1Cc2cc(ccc2CCc2cc(Cl)ccc12)-c1ccc(cc1)C#N