Reaction Details
Target17-beta-hydroxysteroid dehydrogenase type 3
LigandBDBM50179970
Substrate/Competitorn/a
Meas. Tech.ChEMBL_340362 (CHEMBL864403)
IC50 48±n/a nM
Citation Fink, BEGavai, AVTokarski, JSGoyal, BMisra, RXiao, HYKimball, SDHan, WCNorris, DSpires, TEYou, DGottardis, MMLorenzi, MVVite, GD Identification of a novel series of tetrahydrodibenzazocines as inhibitors of 17beta-hydroxysteroid dehydrogenase type 3. Bioorg Med Chem Lett16:1532-6 (2006) 
 
17-beta-hydroxysteroid dehydrogenase type 3
Name:17-beta-hydroxysteroid dehydrogenase type 3
Type:Enzyme
Mol. Mass.:34525.39
Organism:Homo sapiens (Human)
Description:P37058
Residue:310
BDBM50179970
NameBDBM50179970
Synonyms:1-[2-chloro-8-(4-methoxy-phenyl)-11,12-dihydro-6H-dibenzo[b,f]azocin-5-yl]-ethanone | CHEMBL206217
TypeSmall organic molecule
Emp. Form.C24H22ClNO2
Mol. Mass.391.89
SMILESCOc1ccc(cc1)-c1ccc2CCc3cc(Cl)ccc3N(Cc2c1)C(C)=O