Reaction Details
TargetCannabinoid receptor 2
LigandBDBM50067734
Substrate/Competitorn/a
Meas. Tech.ChEMBL_340926 (CHEMBL869518)
Ki 39.3±n/a nM
Citation Papahatjis, DPNahmias, VRAndreou, TFan, PMakriyannis, A Structural modifications of the cannabinoid side chain towards C3-aryl and 1',1'-cycloalkyl-1'-cyano cannabinoids. Bioorg Med Chem Lett16:1616-20 (2006) 
 
Cannabinoid receptor 2
Name:Cannabinoid receptor 2
Type:Enzyme Catalytic Domain
Mol. Mass.:38220.43
Organism:MOUSE
Description:P47936
Residue:347
BDBM50067734
NameBDBM50067734
Synonyms:(-)-(6aR-trans)-6,6,9-trimethyl-3-pentyl-6a,7,10,10a-tetrahydro-6H-benzo[c]chromen-1-ol (6aR,10aR)-6,6,9-Trimethyl-3-pentyl-6a,7,10,10a-tetrahydro-6H-benzo[c]chromen-1-ol CHEMBL267227 | delta 8-tetrahydrocannobinol
TypeSmall organic molecule
Emp. Form.C21H30O2
Mol. Mass.314.4617
SMILESCCCCCc1cc(O)c2[C@@H]3CC(C)=CC[C@H]3C(C)(C)Oc2c1