Reaction Details
TargetDNA topoisomerase 4 subunit A
LigandBDBM50180009
Substrate/Competitorn/a
Meas. Tech.ChEMBL_329797 (CHEMBL854373)
IC50 6300±n/a nM
Citation Wiles, JAHashimoto, AThanassi, JACheng, JIncarvito, CDDeshpande, MPucci, MJBradbury, BJ Isothiazolopyridones: synthesis, structure, and biological activity of a new class of antibacterial agents. J Med Chem49:39-42 (2006) 
 
DNA topoisomerase 4 subunit A
Name:DNA topoisomerase 4 subunit A
Type:PROTEIN
Mol. Mass.:91040.14
Organism:Staphylococcus aureus
Description:ChEMBL_340188
Residue:800
BDBM50180009
NameBDBM50180009
Synonyms:7-(2,6-dimethylpyridin-4-yl)-9-ethyl-1-thia-2,4a-diaza-cyclopenta[b]naphthalene-3,4-dione | CHEMBL200962
TypeSmall organic molecule
Emp. Form.C19H17N3O2S
Mol. Mass.351.422
SMILESCCc1c2s[nH]c(=O)c2c(=O)n2ccc(cc12)-c1cc(C)nc(C)c1