Reaction Details
TargetProtein c-Fos/Transcription factor Jun
LigandBDBM50180048
Substrate/Competitorn/a
Meas. Tech.ChEMBL_329857 (CHEMBL870579)
IC50 13300±n/a nM
Citation Tsuchida, KChaki, HTakakura, TKotsubo, HTanaka, TAikawa, YShiozawa, SHirono, S Discovery of nonpeptidic small-molecule AP-1 inhibitors: lead hopping based on a three-dimensional pharmacophore model. J Med Chem49:80-91 (2006) 
 
Protein c-Fos/Transcription factor Jun
Name:Protein c-Fos/Transcription factor Jun
Type:n/a
Mol. Mass.:n/a
Description:ASSAY_ID of EBI is 305353
Components:This complex has 2 components.
Component 1
Name:Transcription factor Jun
Synonyms:AP1 JUN Proto-oncogene c-JUN Transcription factor AP1 p39
Type:n/a
Mol. Mass.:35683.24
Organism:Homo sapiens (Human)
Description:P05412
Residue:331
Component 2
Name:Protein c-Fos
Synonyms:FOS G0S7 | Transcription factor AP1
Type:PROTEIN
Mol. Mass.:40679.34
Organism:Homo sapiens (Human)
Description:EBI_100167
Residue:380
BDBM50180048
NameBDBM50180048
Synonyms:(R)-8-(3-methylbutylidene)-4-(5-methylhexanoyl)-1-thia-4-aza-spiro[4.5]decane-3-carboxylic acid | CHEMBL426477
TypeSmall organic molecule
Emp. Form.C21H35NO3S
Mol. Mass.381.573
SMILESCC(C)CCCC(=O)N1[C@@H](CSC11CCC(CC1)=CCC(C)C)C(O)=O