Reaction Details
Target5-hydroxytryptamine receptor 1A
LigandBDBM50180054
Substrate/Competitorn/a
Meas. Tech.ChEMBL_330004 (CHEMBL858881)
EC50 0.010000±n/a nM
Citation Kumar, JSMajo, VJHsiung, SCMillak, MSLiu, KPTamir, HPrabhakaran, JSimpson, NRVan Heertum, RLMann, JJParsey, RV Synthesis and in vivo validation of [O-methyl-11C]2-{4-[4-(7-methoxynaphthalen-1-yl)piperazin- 1-yl]butyl}-4-methyl-2H-[1,2,4]triazine-3,5-dione: a novel 5-HT1A receptor agonist positron emission tomography ligand. J Med Chem49:125-34 (2006) 
 
5-hydroxytryptamine receptor 1A
Name:5-hydroxytryptamine receptor 1A
Type:n/a
Mol. Mass.:46122.49
Organism:Homo sapiens (Human)
Description:n/a
Residue:422
BDBM50180054
NameBDBM50180054
Synonyms:CHEMBL199824 | [O-methyl-11C]2-{4-[4-(7-methoxynaphthalen-1-yl)piperazin-1-yl]butyl}-4-methyl-2H-[1,2,4]triazine-3,5-dione
TypeSmall organic molecule
Emp. Form.C23H29N5O3
Mol. Mass.423.5081
SMILESCOc1ccc2cccc(N3CCN(CCCCn4ncc(=O)n(C)c4=O)CC3)c2c1