Reaction Details
TargetPhosphotransferase
LigandBDBM50173790
Substrate/Competitorn/a
Meas. Tech.ChEMBL_330068 (CHEMBL865780)
IC50 3470±n/a nM
Citation Hudock, MPSanz-Rodríguez, CESong, YChan, JMZhang, YOdeh, SKosztowski, TLeon-Rossell, AConcepción, JLYardley, VCroft, SLUrbina, JAOldfield, E Inhibition of Trypanosoma cruzi hexokinase by bisphosphonates. J Med Chem49:215-23 (2006) 
 
Phosphotransferase
Name:Phosphotransferase
Synonyms:Hexokinase
Type:PROTEIN
Mol. Mass.:52180.94
Organism:Trypanosoma cruzi
Description:ChEMBL_330068
Residue:471
BDBM50173790
NameBDBM50173790
TypeSmall organic molecule
Emp. Form.C14H17NO6P2
Mol. Mass.357.2354
SMILESOP(O)(=O)C(CNc1cccc(c1)-c1ccccc1)P(O)(O)=O