Reaction Details
TargetPhosphotransferase
LigandBDBM50173768
Substrate/Competitorn/a
Meas. Tech.ChEMBL_330068 (CHEMBL865780)
IC50 34700±n/a nM
Citation Hudock, MPSanz-Rodríguez, CESong, YChan, JMZhang, YOdeh, SKosztowski, TLeon-Rossell, AConcepción, JLYardley, VCroft, SLUrbina, JAOldfield, E Inhibition of Trypanosoma cruzi hexokinase by bisphosphonates. J Med Chem49:215-23 (2006) 
 
Phosphotransferase
Name:Phosphotransferase
Synonyms:Hexokinase
Type:PROTEIN
Mol. Mass.:52180.94
Organism:Trypanosoma cruzi
Description:ChEMBL_330068
Residue:471
BDBM50173768
NameBDBM50173768
TypeSmall organic molecule
Emp. Form.C13H14O7P2
Mol. Mass.344.1936
SMILESOC(c1cccc(c1)-c1ccccc1)(P(O)(O)=O)P(O)(O)=O