Reaction Details
TargetPhosphotransferase
LigandBDBM50180147
Substrate/Competitorn/a
Meas. Tech.ChEMBL_330068 (CHEMBL865780)
IC50 3311311214826±n/a nM
Citation Hudock, MPSanz-Rodríguez, CESong, YChan, JMZhang, YOdeh, SKosztowski, TLeon-Rossell, AConcepción, JLYardley, VCroft, SLUrbina, JAOldfield, E Inhibition of Trypanosoma cruzi hexokinase by bisphosphonates. J Med Chem49:215-23 (2006) 
 
Phosphotransferase
Name:Phosphotransferase
Synonyms:Hexokinase
Type:PROTEIN
Mol. Mass.:52180.94
Organism:Trypanosoma cruzi
Description:ChEMBL_330068
Residue:471
BDBM50180147
NameBDBM50180147
TypeSmall organic molecule
Emp. Form.C8H19NO7P2
Mol. Mass.303.1865
SMILESOC(NC1CCCCCC1)(P(O)(O)=O)P(O)(O)=O