Reaction Details
TargetAdenosine receptor A2a
LigandBDBM50180215
Substrate/Competitorn/a
Meas. Tech.ChEMBL_330116 (CHEMBL863396)
Ki 4890±n/a nM
Citation Jeong, LSLee, HWJacobson, KAKim, HOShin, DHLee, JAGao, ZGLu, CDuong, HTGunaga, PLee, SKJin, DZChun, MWMoon, HR Structure-activity relationships of 2-chloro-N6-substituted-4'-thioadenosine-5'-uronamides as highly potent and selective agonists at the human A3 adenosine receptor. J Med Chem49:273-81 (2006) 
 
Adenosine receptor A2a
Name:Adenosine receptor A2a
Type:G Protein-Coupled Receptor (GPCR)
Mol. Mass.:44716.46
Organism:Homo sapiens (Human)
Description:P29274
Residue:412
BDBM50180215
NameBDBM50180215
Synonyms:(2S,3S,4R,5R)-5-(2-chloro-6-(cyclopropylamino)-9H-purin-9-yl)-3,4-dihydroxy-N-methyl-tetrahydrothiophene-2-carboxamide | CHEMBL200184
TypeSmall organic molecule
Emp. Form.C14H17ClN6O3S
Mol. Mass.384.841
SMILESCNC(=O)[C@H]1S[C@H]([C@H](O)[C@@H]1O)n1cnc2c(NC3CC3)nc(Cl)nc12