Reaction Details
TargetAdenosine receptor A3
LigandBDBM50180219
Substrate/Competitorn/a
Meas. Tech.ChEMBL_330118 (CHEMBL863398)
Ki 0.4±n/a nM
Citation Jeong, LSLee, HWJacobson, KAKim, HOShin, DHLee, JAGao, ZGLu, CDuong, HTGunaga, PLee, SKJin, DZChun, MWMoon, HR Structure-activity relationships of 2-chloro-N6-substituted-4'-thioadenosine-5'-uronamides as highly potent and selective agonists at the human A3 adenosine receptor. J Med Chem49:273-81 (2006) 
 
Adenosine receptor A3
Name:Adenosine receptor A3
Type:G Protein-Coupled Receptor (GPCR)
Mol. Mass.:36197.32
Organism:Homo sapiens (Human)
Description:P0DMS8
Residue:318
BDBM50180219
NameBDBM50180219
Synonyms:(2-chloropurin-9-yl)-3,4-dihydroxytetrahydrothiphene-2-carboxylic acid methyl amide | CHEMBL203357
TypeSmall organic molecule
Emp. Form.C11H13ClN6O3S
Mol. Mass.344.777
SMILESCNC(=O)[C@H]1S[C@H]([C@H](O)[C@@H]1O)n1cnc2c(N)nc(Cl)nc12