Reaction Details
TargetAdenosine receptor A3
LigandBDBM50180204
Substrate/Competitorn/a
Meas. Tech.ChEMBL_330118 (CHEMBL863398)
Ki 0.67±n/a nM
Citation Jeong, LSLee, HWJacobson, KAKim, HOShin, DHLee, JAGao, ZGLu, CDuong, HTGunaga, PLee, SKJin, DZChun, MWMoon, HR Structure-activity relationships of 2-chloro-N6-substituted-4'-thioadenosine-5'-uronamides as highly potent and selective agonists at the human A3 adenosine receptor. J Med Chem49:273-81 (2006) 
 
Adenosine receptor A3
Name:Adenosine receptor A3
Type:G Protein-Coupled Receptor (GPCR)
Mol. Mass.:36197.32
Organism:Homo sapiens (Human)
Description:P0DMS8
Residue:318
BDBM50180204
NameBDBM50180204
Synonyms:(2S,3S,4R,5R)-5-(2-chloro-6-(cyclopropylamino)-9H-purin-9-yl)-N-ethyl-3,4-dihydroxy-tetrahydrothiophene-2-carboxamide | CHEMBL200705
TypeSmall organic molecule
Emp. Form.C15H19ClN6O3S
Mol. Mass.398.868
SMILESCCNC(=O)[C@H]1S[C@H]([C@H](O)[C@@H]1O)n1cnc2c(NC3CC3)nc(Cl)nc12