Reaction Details
Target5-hydroxytryptamine receptor 2B
LigandBDBM50180254
Substrate/Competitorn/a
Meas. Tech.ChEMBL_329320 (CHEMBL863543)
Ki 6±n/a nM
Citation May, JADantanarayana, APZinke, PWMcLaughlin, MASharif, NA 1-((S)-2-aminopropyl)-1H-indazol-6-ol: a potent peripherally acting 5-HT2 receptor agonist with ocular hypotensive activity. J Med Chem49:318-28 (2006) 
 
5-hydroxytryptamine receptor 2B
Name:5-hydroxytryptamine receptor 2B
Type:G Protein-Coupled Receptor (GPCR)
Mol. Mass.:54312.47
Organism:Homo sapiens (Human)
Description:Receptor binding assays were performed using human clone stably expressed in CHO cells.
Residue:481
BDBM50180254
NameBDBM50180254
Synonyms:1-((S)-2-aminopropyl)-7-iodo-1H-indazol-6-ol | CHEMBL201132
TypeSmall organic molecule
Emp. Form.C10H12IN3O
Mol. Mass.317.1263
SMILESC[C@H](N)Cn1ncc2ccc(O)c(I)c12