Reaction Details
Target5-hydroxytryptamine receptor 1D
LigandBDBM50180251
Substrate/Competitorn/a
Meas. Tech.ChEMBL_329324 (CHEMBL863547)
Ki 7870±n/a nM
Citation May, JADantanarayana, APZinke, PWMcLaughlin, MASharif, NA 1-((S)-2-aminopropyl)-1H-indazol-6-ol: a potent peripherally acting 5-HT2 receptor agonist with ocular hypotensive activity. J Med Chem49:318-28 (2006) 
 
5-hydroxytryptamine receptor 1D
Name:5-hydroxytryptamine receptor 1D
Type:G Protein-Coupled Receptor (GPCR)
Mol. Mass.:41920.63
Organism:Homo sapiens (Human)
Description:Receptor binding assays were performed using human clone stably expressed in CHO cells.
Residue:377
BDBM50180251
NameBDBM50180251
Synonyms:1-((S)-2-aminopropyl)-1H-indazol-6-ol | CHEMBL371300
TypeSmall organic molecule
Emp. Form.C10H13N3O
Mol. Mass.191.2297
SMILESC[C@H](N)Cn1ncc2ccc(O)cc12