Reaction Details
TargetHeat shock protein HSP 90-beta
LigandBDBM50180305
Substrate/Competitorn/a
Meas. Tech.ChEMBL_329524 (CHEMBL859807)
EC50 51.2±n/a nM
Citation He, HZatorska, DKim, JAguirre, JLlauger, LShe, YWu, NImmormino, RMGewirth, DTChiosis, G Identification of potent water soluble purine-scaffold inhibitors of the heat shock protein 90. J Med Chem49:381-90 (2006) 
 
Heat shock protein HSP 90-beta
Name:Heat shock protein HSP 90-beta
Type:Molecular Chaperone
Mol. Mass.:83229.45
Organism:Homo sapiens (Human)
Description:P08238
Residue:724
BDBM50180305
NameBDBM50180305
Synonyms:2-fluoro-8-(6-chloro-benzo[1,3]dioxol-5-ylmethyl)-9-(pent-4-ynyl)adenine US10676476, Example 7
TypeSmall organic molecule
Emp. Form.C18H15ClFN5O2
Mol. Mass.387.795
SMILESNc1nc(F)nc2n(CCCC#C)c(Cc3cc4OCOc4cc3Cl)nc12