Reaction Details
TargetPlasma kallikrein
LigandBDBM14944
Substrate/Competitorn/a
Meas. Tech.ChEMBL_344178 (CHEMBL868878)
Ki 27±n/a nM
Citation Young, WBRai, RShrader, WDBurgess-Henry, JHu, HElrod, KCSprengeler, PAKatz, BASukbuntherng, JMordenti, J Small molecule inhibitors of plasma kallikrein. Bioorg Med Chem Lett16:2034-6 (2006) 
 
Plasma kallikrein
Name:Plasma kallikrein
Type:Protein
Mol. Mass.:71391.16
Organism:Homo sapiens (Human)
Description:P03952
Residue:638
BDBM14944
NameBDBM14944
Synonyms:2-[3-(5-carbamimidoyl-1H-1,3-benzodiazol-2-yl)-4-hydroxy-5-(4-methoxyphenyl)phenyl]butanedioic acid CHEMBL381702
TypeSmall organic molecule
Emp. Form.C25H22N4O6
Mol. Mass.474.4654
SMILESCOc1ccc(cc1)-c1cc(cc(-c2nc3ccc(cc3[nH]2)C(N)=N)c1O)C(CC(O)=O)C(O)=O