Reaction Details
TargetPlasma kallikrein
LigandBDBM14912
Substrate/Competitorn/a
Meas. Tech.ChEMBL_344178 (CHEMBL868878)
Ki 6±n/a nM
Citation Young, WBRai, RShrader, WDBurgess-Henry, JHu, HElrod, KCSprengeler, PAKatz, BASukbuntherng, JMordenti, J Small molecule inhibitors of plasma kallikrein. Bioorg Med Chem Lett16:2034-6 (2006) 
 
Plasma kallikrein
Name:Plasma kallikrein
Type:Protein
Mol. Mass.:71391.16
Organism:Homo sapiens (Human)
Description:P03952
Residue:638
BDBM14912
NameBDBM14912
Synonyms:2-[3-(5-carbamimidoyl-1H-1,3-benzodiazol-2-yl)-5-(3-acetylphenyl)-4-hydroxyphenyl]butanedioic acid CHEMBL379906
TypeSmall organic molecule
Emp. Form.C26H22N4O6
Mol. Mass.486.4761
SMILESCC(=O)c1cccc(c1)-c1cc(cc(-c2nc3ccc(cc3[nH]2)C(N)=N)c1O)C(CC(O)=O)C(O)=O