Reaction Details
TargetTransient receptor potential cation channel subfamily V member 1
LigandBDBM50180708
Substrate/Competitorn/a
Meas. Tech.ChEMBL_326996 (CHEMBL863528)
IC50 49±n/a nM
Citation Culshaw, AJBevan, SChristiansen, MCopp, PDavis, ADavis, CDyson, ADziadulewicz, EKEdwards, LEggelte, HFox, AGentry, CGroarke, AHallett, AHart, TWHughes, GAKnights, SKotsonis, PLee, WLyothier, IMcBryde, AMcIntyre, PPaloumbis, GPanesar, MPatel, SSeiler, MPYaqoob, MZimmermann, K Identification and biological characterization of 6-aryl-7-isopropylquinazolinones as novel TRPV1 antagonists that are effective in models of chronic pain. J Med Chem49:471-4 (2006) 
 
Transient receptor potential cation channel subfamily V member 1
Name:Transient receptor potential cation channel subfamily V member 1
Type:Protein
Mol. Mass.:94960.75
Organism:Homo sapiens (Human)
Description:Q8NER1
Residue:839
BDBM50180708
NameBDBM50180708
Synonyms:7-tert-butyl-6-phenyl-2-thioxo-2,3-dihydro-1H-pyrido[2,3-d]pyrimidin-4-one | CHEMBL199393
TypeSmall organic molecule
Emp. Form.C17H17N3OS
Mol. Mass.311.401
SMILESCC(C)(C)c1nc2[nH]c(=S)[nH]c(=O)c2cc1-c1ccccc1