Reaction Details
TargetTransient receptor potential cation channel subfamily V member 1
LigandBDBM50180712
Substrate/Competitorn/a
Meas. Tech.ChEMBL_326994 (CHEMBL863527)
IC50 201±n/a nM
Citation Culshaw, AJBevan, SChristiansen, MCopp, PDavis, ADavis, CDyson, ADziadulewicz, EKEdwards, LEggelte, HFox, AGentry, CGroarke, AHallett, AHart, TWHughes, GAKnights, SKotsonis, PLee, WLyothier, IMcBryde, AMcIntyre, PPaloumbis, GPanesar, MPatel, SSeiler, MPYaqoob, MZimmermann, K Identification and biological characterization of 6-aryl-7-isopropylquinazolinones as novel TRPV1 antagonists that are effective in models of chronic pain. J Med Chem49:471-4 (2006) 
 
Transient receptor potential cation channel subfamily V member 1
Name:Transient receptor potential cation channel subfamily V member 1
Type:Protein
Mol. Mass.:94960.75
Organism:Homo sapiens (Human)
Description:Q8NER1
Residue:839
BDBM50180712
NameBDBM50180712
Synonyms:6-(4-chloro-3-isopropoxy-phenyl)-7-isopropyl-2-methyl-3H-quinazoline-4-one | CHEMBL201259
TypeSmall organic molecule
Emp. Form.C21H23ClN2O2
Mol. Mass.370.873
SMILESCC(C)Oc1cc(ccc1Cl)-c1cc2c(cc1C(C)C)nc(C)[nH]c2=O