Reaction Details
TargetMethionine aminopeptidase
LigandBDBM50121347
Substrate/Competitorn/a
Meas. Tech.ChEMBL_329657 (CHEMBL865844)
IC50 472±n/a nM
Citation Schiffmann, RNeugebauer, AKlein, CD Metal-mediated inhibition of Escherichia coli methionine aminopeptidase: structure-activity relationships and development of a novel scoring function for metal-ligand interactions. J Med Chem49:511-22 (2006) 
 
Methionine aminopeptidase
Name:Methionine aminopeptidase
Type:Enzyme
Mol. Mass.:29326.96
Organism:Escherichia coli (strain K12)
Description:Full-length untagged EcMAP was expressed in E. coli.
Residue:264
BDBM50121347
NameBDBM50121347
Synonyms:CHEMBL625 | THIABENDAZOLE
TypeSmall organic molecule
Emp. Form.C10H7N3S
Mol. Mass.201.248
SMILESc1nc(cs1)-c1nc2ccccc2[nH]1