Reaction Details
TargetCalcitonin gene-related peptide type 1 receptor/Receptor activity-modifying protein 1
LigandBDBM50180776
Substrate/Competitorn/a
Meas. Tech.ChEMBL_327201 (CHEMBL859562)
Ki 1.8±n/a nM
Citation Lang, MDe Pol, SBaldauf, CHofmann, HJReiser, OBeck-Sickinger, AG Identification of the key residue of calcitonin gene related peptide (CGRP) 27-37 to obtain antagonists with picomolar affinity at the CGRP receptor. J Med Chem49:616-24 (2006) 
 
Calcitonin gene-related peptide type 1 receptor/Receptor activity-modifying protein 1
Name:Calcitonin gene-related peptide type 1 receptor/Receptor activity-modifying protein 1
Synonyms:Calcitonin-gene-related peptide receptor, CALCRL/RAMP1
Type:n/a
Mol. Mass.:n/a
Description:ASSAY_ID of EBI is 327200
Components:This complex has 2 components.
Component 1
Name:Calcitonin gene-related peptide type 1 receptor
Type:Enzyme Catalytic Domain
Mol. Mass.:52980.45
Organism:Homo sapiens (Human)
Description:Q16602
Residue:461
Component 2
Name:Receptor activity-modifying protein 1
Synonyms:Calcitonin-gene-related peptide receptor, CALCRL/RAMP1 RAMP1_HUMAN
Type:PROTEIN
Mol. Mass.:16992.80
Organism:Homo sapiens (Human)
Description:EBI_100673
Residue:148
BDBM50180776
NameBDBM50180776
Synonyms:CHEMBL2371892 | FVPTDVG-Tic-FAF-Tic
TypeSmall organic molecule
Emp. Form.C75H92N12O16
Mol. Mass.1417.6038
SMILESCC(C)[C@H](NC(=O)[C@H](CC(O)=O)NC(=O)[C@@H](NC(=O)[C@@H]1CCCN1C(=O)[C@@H](NC(=O)[C@@H](N)Cc1ccccc1)C(C)C)[C@@H](C)O)C(=O)NCC(=O)N1Cc2ccccc2C[C@H]1C(=O)N[C@@H](Cc1ccccc1)C(=O)N[C@@H](C)C(=O)N[C@@H](Cc1ccccc1)C(=O)N1Cc2ccccc2C[C@H]1C(O)=O