Reaction Details
TargetOrphan methyltransferase M.SssI
LigandBDBM50180790
Substrate/Competitorn/a
Meas. Tech.ChEMBL_327234 (CHEMBL862800)
IC50 600±n/a nM
Citation Siedlecki, PGarcia Boy, RMusch, TBrueckner, BSuhai, SLyko, FZielenkiewicz, P Discovery of two novel, small-molecule inhibitors of DNA methylation. J Med Chem49:678-83 (2006) 
 
Orphan methyltransferase M.SssI
Name:Orphan methyltransferase M.SssI
Type:Protein
Mol. Mass.:44323.75
Organism:Spiroplasma monobiae strain MQ-1
Description:P15840
Residue:386
BDBM50180790
NameBDBM50180790
Synonyms:2-(1,3-dioxoisoindolin-2-yl)-3-(1H-indol-3-yl)propanoic acid | CHEMBL383475
TypeSmall organic molecule
Emp. Form.C19H14N2O4
Mol. Mass.334.3255
SMILESOC(=O)C(Cc1c[nH]c2ccccc12)N1C(=O)c2ccccc2C1=O