Reaction Details
TargetPhospholipase B
LigandBDBM50060582
Substrate/Competitorn/a
Meas. Tech.ChEMBL_330127 (CHEMBL858987)
IC50>250000±n/a nM
Citation Ng, CKObando, DWidmer, FWright, LCSorrell, TCJolliffe, KA Correlation of antifungal activity with fungal phospholipase inhibition using a series of bisquaternary ammonium salts. J Med Chem49:811-6 (2006) 
 
Phospholipase B
Name:Phospholipase B
Type:PROTEIN
Mol. Mass.:68557.23
Organism:Cryptococcus neoformans
Description:ChEMBL_330127
Residue:637
BDBM50060582
NameBDBM50060582
Synonyms:1,10-Bis(trimethyl ammonium)decane dibromide CHEMBL1134 DECAMETHONIUM BROMIDE N,N,N'',N''-Tetramethyl-decane-1,10-diammonium; dibromide Syncurine | decane-1,10-bis(trimethylammonium bromide)
TypeSmall organic molecule
Emp. Form.C16H38N2
Mol. Mass.258.4852
SMILESC[N+](C)(C)CCCCCCCCCC[N+](C)(C)C