Reaction Details
TargetPhospholipase B
LigandBDBM50084949
Substrate/Competitorn/a
Meas. Tech.ChEMBL_330127 (CHEMBL858987)
IC50>250000±n/a nM
Citation Ng, CKObando, DWidmer, FWright, LCSorrell, TCJolliffe, KA Correlation of antifungal activity with fungal phospholipase inhibition using a series of bisquaternary ammonium salts. J Med Chem49:811-6 (2006) 
 
Phospholipase B
Name:Phospholipase B
Type:PROTEIN
Mol. Mass.:68557.23
Organism:Cryptococcus neoformans
Description:ChEMBL_330127
Residue:637
BDBM50084949
NameBDBM50084949
Synonyms:1,12-Bis(N-methylpyrrolidinium)dodecane dibromide CHEMBL149661
TypeSmall organic molecule
Emp. Form.C22H46N2
Mol. Mass.338.6129
SMILESC[N+]1(CCCCCCCCCCCC[N+]2(C)CCCC2)CCCC1