Reaction Details
TargetPhospholipase B
LigandBDBM50060533
Substrate/Competitorn/a
Meas. Tech.ChEMBL_330127 (CHEMBL858987)
IC50>250000±n/a nM
Citation Ng, CKObando, DWidmer, FWright, LCSorrell, TCJolliffe, KA Correlation of antifungal activity with fungal phospholipase inhibition using a series of bisquaternary ammonium salts. J Med Chem49:811-6 (2006) 
 
Phospholipase B
Name:Phospholipase B
Type:PROTEIN
Mol. Mass.:68557.23
Organism:Cryptococcus neoformans
Description:ChEMBL_330127
Residue:637
BDBM50060533
NameBDBM50060533
Synonyms:1,12-Bis(trimethyl ammonium)dodecane dibromide CHEMBL119701 N,N,N,N',N',N'-Hexamethyl-1,12-dodecane diaminium dibromide N1,N1,N1,N12,N12,N12-hexamethyldodecane-1,12-diaminium bromide | dodecane-1,12-bis(trimethylammonium bromide)
TypeSmall organic molecule
Emp. Form.C18H42N2
Mol. Mass.286.5384
SMILESC[N+](C)(C)CCCCCCCCCCCC[N+](C)(C)C