Reaction Details
TargetInterstitial collagenase
LigandBDBM50181002
Substrate/Competitorn/a
Meas. Tech.ChEMBL_339180 (CHEMBL867736)
IC50 1±n/a nM
Citation Levin, JIChen, JMLaakso, LMDu, MSchmid, JXu, WCummons, TXu, JJin, GBarone, DSkotnicki, JS Acetylenic TACE inhibitors. Part 3: Thiomorpholine sulfonamide hydroxamates. Bioorg Med Chem Lett16:1605-9 (2006) 
 
Interstitial collagenase
Name:Interstitial collagenase
Type:Enzyme
Mol. Mass.:54010.26
Organism:Homo sapiens (Human)
Description: P03956
Residue:469
BDBM50181002
NameBDBM50181002
Synonyms:(S)-N-hydroxy-2,2-dimethyl-4-(4-(prop-2-ynyloxy)phenylsulfonyl)thiomorpholine-3-carboxamide | CHEMBL207776
TypeSmall organic molecule
Emp. Form.C16H20N2O5S2
Mol. Mass.384.47
SMILESCC1(C)SCCN([C@H]1C(=O)NO)S(=O)(=O)c1ccc(OCC#C)cc1