Reaction Details
TargetMetabotropic glutamate receptor 5
LigandBDBM50181065
Substrate/Competitorn/a
Meas. Tech.ChEMBL_345726 (CHEMBL860880)
Ki 17±n/a nM
Citation Büttelmann, BPeters, JUCeccarelli, SKolczewski, SVieira, EPrinssen, EPSpooren, WSchuler, FHuwyler, JPorter, RHJaeschke, G Arylmethoxypyridines as novel, potent and orally active mGlu5 receptor antagonists. Bioorg Med Chem Lett16:1892-7 (2006) 
 
Metabotropic glutamate receptor 5
Name:Metabotropic glutamate receptor 5
Type:Enzyme
Mol. Mass.:132484.72
Organism:Homo sapiens (Human)
Description:n/a
Residue:1212
BDBM50181065
NameBDBM50181065
Synonyms:2-chloro-6-((2-chloropyridin-4-yl)methoxy)isonicotinonitrile | CHEMBL206296
TypeSmall organic molecule
Emp. Form.C12H7Cl2N3O
Mol. Mass.280.109
SMILESClc1cc(COc2cc(cc(Cl)n2)C#N)ccn1