Reaction Details
TargetMetabotropic glutamate receptor 5
LigandBDBM50181083
Substrate/Competitorn/a
Meas. Tech.ChEMBL_345726 (CHEMBL860880)
Ki 28±n/a nM
Citation Büttelmann, BPeters, JUCeccarelli, SKolczewski, SVieira, EPrinssen, EPSpooren, WSchuler, FHuwyler, JPorter, RHJaeschke, G Arylmethoxypyridines as novel, potent and orally active mGlu5 receptor antagonists. Bioorg Med Chem Lett16:1892-7 (2006) 
 
Metabotropic glutamate receptor 5
Name:Metabotropic glutamate receptor 5
Type:Enzyme
Mol. Mass.:132484.72
Organism:Homo sapiens (Human)
Description:n/a
Residue:1212
BDBM50181083
NameBDBM50181083
Synonyms:(5-(2-(3-chlorobenzyloxy)-6-methylpyridin-4-yl)oxazol-4-yl)methanol | CHEMBL383758
TypeSmall organic molecule
Emp. Form.C17H15ClN2O3
Mol. Mass.330.766
SMILESCc1cc(cc(OCc2cccc(Cl)c2)n1)-c1ocnc1CO