Reaction Details
TargetMuscarinic acetylcholine receptor M3
LigandBDBM50181105
Substrate/Competitorn/a
Meas. Tech.ChEMBL_345379 (CHEMBL861122)
Ki 10±n/a nM
Citation Provins, LChristophe, BDanhaive, PDulieu, JDurieu, VGillard, MLebon, FLengelé, SQuéré, Lvan Keulen, B First dual M3 antagonists-PDE4 inhibitors: synthesis and SAR of 4,6-diaminopyrimidine derivatives. Bioorg Med Chem Lett16:1834-9 (2006) 
 
Muscarinic acetylcholine receptor M3
Name:Muscarinic acetylcholine receptor M3
Type:Enzyme
Mol. Mass.:66151.03
Organism:Homo sapiens (Human)
Description:P20309
Residue:590
BDBM50181105
NameBDBM50181105
Synonyms:4-(azepan-1-yl)-2-cyclopropyl-6,7,8,9-tetrahydro-5H-pyrimido[4,5-b]azepine | CHEMBL207816
TypeSmall organic molecule
Emp. Form.C17H26N4
Mol. Mass.286.4151
SMILESC1CC1c1nc2NCCCCc2c(n1)N1CCCCCC1