Reaction Details
TargetMuscarinic acetylcholine receptor M3
LigandBDBM50181100
Substrate/Competitorn/a
Meas. Tech.ChEMBL_345379 (CHEMBL861122)
Ki 6.3±n/a nM
Citation Provins, LChristophe, BDanhaive, PDulieu, JDurieu, VGillard, MLebon, FLengelé, SQuéré, Lvan Keulen, B First dual M3 antagonists-PDE4 inhibitors: synthesis and SAR of 4,6-diaminopyrimidine derivatives. Bioorg Med Chem Lett16:1834-9 (2006) 
 
Muscarinic acetylcholine receptor M3
Name:Muscarinic acetylcholine receptor M3
Type:Enzyme
Mol. Mass.:66151.03
Organism:Homo sapiens (Human)
Description:P20309
Residue:590
BDBM50181100
NameBDBM50181100
Synonyms:6-(3-aza-bicyclo[3.2.1]octan-3-yl)-N,2-dicyclopropyl-5-methylpyrimidin-4-amine | CHEMBL205976
TypeSmall organic molecule
Emp. Form.C18H26N4
Mol. Mass.298.4258
SMILESCc1c(NC2CC2)nc(nc1N1CC2CCC(C2)C1)C1CC1