Reaction Details
TargetMuscarinic acetylcholine receptor M3
LigandBDBM50181115
Substrate/Competitorn/a
Meas. Tech.ChEMBL_345379 (CHEMBL861122)
Ki 126±n/a nM
Citation Provins, LChristophe, BDanhaive, PDulieu, JDurieu, VGillard, MLebon, FLengelé, SQuéré, Lvan Keulen, B First dual M3 antagonists-PDE4 inhibitors: synthesis and SAR of 4,6-diaminopyrimidine derivatives. Bioorg Med Chem Lett16:1834-9 (2006) 
 
Muscarinic acetylcholine receptor M3
Name:Muscarinic acetylcholine receptor M3
Type:Enzyme
Mol. Mass.:66151.03
Organism:Homo sapiens (Human)
Description:P20309
Residue:590
BDBM50181115
NameBDBM50181115
Synonyms:6-(azepan-1-yl)-N-cyclopropyl-2-(cyclopropylmethyl)-5-methylpyrimidin-4-amine | CHEMBL378904
TypeSmall organic molecule
Emp. Form.C18H28N4
Mol. Mass.300.4417
SMILESCc1c(NC2CC2)nc(CC2CC2)nc1N1CCCCCC1