Reaction Details
TargetD(3) dopamine receptor
LigandBDBM50181158
Substrate/Competitorn/a
Meas. Tech.ChEMBL_346082 (CHEMBL862318)
Ki 7.9±n/a nM
Citation Geneste, HAmberg, WBackfisch, GBeyerbach, ABraje, WMDelzer, JHaupt, AHutchins, CWKing, LLSauer, DRUnger, LWernet, W Synthesis and SAR of highly potent and selective dopamine D3-receptor antagonists: variations on the 1H-pyrimidin-2-one theme. Bioorg Med Chem Lett16:1934-7 (2006) 
 
D(3) dopamine receptor
Name:D(3) dopamine receptor
Type:n/a
Mol. Mass.:44243.43
Organism:Homo sapiens (Human)
Description:n/a
Residue:400
BDBM50181158
NameBDBM50181158
Synonyms:1-(4-(4-(2-tert-butyl-6-(trifluoromethyl)pyrimidin-4-yl)piperazin-1-yl)butyl)-4-phenylpyridin-2(1H)-one | CHEMBL207880
TypeSmall organic molecule
Emp. Form.C28H34F3N5O
Mol. Mass.513.5977
SMILESCC(C)(C)c1nc(cc(n1)C(F)(F)F)N1CCN(CCCCn2ccc(cc2=O)-c2ccccc2)CC1