Reaction Details
TargetD(3) dopamine receptor
LigandBDBM50181174
Substrate/Competitorn/a
Meas. Tech.ChEMBL_346082 (CHEMBL862318)
Ki 9.3±n/a nM
Citation Geneste, HAmberg, WBackfisch, GBeyerbach, ABraje, WMDelzer, JHaupt, AHutchins, CWKing, LLSauer, DRUnger, LWernet, W Synthesis and SAR of highly potent and selective dopamine D3-receptor antagonists: variations on the 1H-pyrimidin-2-one theme. Bioorg Med Chem Lett16:1934-7 (2006) 
 
D(3) dopamine receptor
Name:D(3) dopamine receptor
Type:n/a
Mol. Mass.:44243.43
Organism:Homo sapiens (Human)
Description:n/a
Residue:400
BDBM50181174
NameBDBM50181174
Synonyms:1-(4-(4-(2-tert-butyl-6-(trifluoromethyl)pyrimidin-4-yl)piperazin-1-yl)butyl)-3-(trifluoromethyl)pyridin-2(1H)-one | CHEMBL206528
TypeSmall organic molecule
Emp. Form.C23H29F6N5O
Mol. Mass.505.4997
SMILESCC(C)(C)c1nc(cc(n1)C(F)(F)F)N1CCN(CCCCn2cccc(c2=O)C(F)(F)F)CC1