Reaction Details
TargetGrowth hormone secretagogue receptor type 1
LigandBDBM50181182
Substrate/Competitorn/a
Meas. Tech.ChEMBL_345662 (CHEMBL870659)
IC50 2.7±n/a nM
Citation Liu, BLiu, MXin, ZZhao, HSerby, MDKosogof, CNelson, LTSzczepankiewicz, BGKaszubska, WSchaefer, VGFalls, HDLin, CWCollins, CASham, HLLiu, G Optimization of 2,4-diaminopyrimidines as GHS-R antagonists: side chain exploration. Bioorg Med Chem Lett16:1864-8 (2006) 
 
Growth hormone secretagogue receptor type 1
Name:Growth hormone secretagogue receptor type 1
Type:Receptor
Mol. Mass.:41334.57
Organism:Homo sapiens (Human)
Description:Receptor binding studies use plasma membranes from LLC PK-1 cells transiently transfected with hGHSR1a.
Residue:366
BDBM50181182
NameBDBM50181182
Synonyms:5-(4-(4-(methylsulfonyl)benzylamino)phenyl)-6-((furan-2-ylmethoxy)methyl)pyrimidine-2,4-diamine | CHEMBL380971
TypeSmall organic molecule
Emp. Form.C24H25N5O4S
Mol. Mass.479.551
SMILESCS(=O)(=O)c1ccc(CNc2ccc(cc2)-c2c(N)nc(N)nc2COCc2ccco2)cc1