Reaction Details
TargetGrowth hormone secretagogue receptor type 1
LigandBDBM50181214
Substrate/Competitorn/a
Meas. Tech.ChEMBL_345662 (CHEMBL870659)
IC50 1.5±n/a nM
Citation Liu, BLiu, MXin, ZZhao, HSerby, MDKosogof, CNelson, LTSzczepankiewicz, BGKaszubska, WSchaefer, VGFalls, HDLin, CWCollins, CASham, HLLiu, G Optimization of 2,4-diaminopyrimidines as GHS-R antagonists: side chain exploration. Bioorg Med Chem Lett16:1864-8 (2006) 
 
Growth hormone secretagogue receptor type 1
Name:Growth hormone secretagogue receptor type 1
Type:Receptor
Mol. Mass.:41334.57
Organism:Homo sapiens (Human)
Description:Receptor binding studies use plasma membranes from LLC PK-1 cells transiently transfected with hGHSR1a.
Residue:366
BDBM50181214
NameBDBM50181214
Synonyms:5-(4-(4-(methylsulfonyl)benzylamino)phenyl)-6-((4-fluorophenylamino)methyl)pyrimidine-2,4-diamine | CHEMBL206820
TypeSmall organic molecule
Emp. Form.C25H25FN6O2S
Mol. Mass.492.568
SMILESCS(=O)(=O)c1ccc(CNc2ccc(cc2)-c2c(N)nc(N)nc2CNc2ccc(F)cc2)cc1