Reaction Details
TargetGrowth hormone secretagogue receptor type 1
LigandBDBM50181184
Substrate/Competitorn/a
Meas. Tech.ChEMBL_345663 (CHEMBL859713)
IC50 1.9±n/a nM
Citation Liu, BLiu, MXin, ZZhao, HSerby, MDKosogof, CNelson, LTSzczepankiewicz, BGKaszubska, WSchaefer, VGFalls, HDLin, CWCollins, CASham, HLLiu, G Optimization of 2,4-diaminopyrimidines as GHS-R antagonists: side chain exploration. Bioorg Med Chem Lett16:1864-8 (2006) 
 
Growth hormone secretagogue receptor type 1
Name:Growth hormone secretagogue receptor type 1
Type:Receptor
Mol. Mass.:41334.57
Organism:Homo sapiens (Human)
Description:Receptor binding studies use plasma membranes from LLC PK-1 cells transiently transfected with hGHSR1a.
Residue:366
BDBM50181184
NameBDBM50181184
Synonyms:5-(4-(4-(methylsulfonyl)benzylamino)phenyl)-6-((3-methylbut-2-enyloxy)methyl)pyrimidine-2,4-diamine | CHEMBL208424
TypeSmall organic molecule
Emp. Form.C24H29N5O3S
Mol. Mass.467.584
SMILES[#6]\[#6](-[#6])=[#6]\[#6]-[#8]-[#6]-c1nc(-[#7])nc(-[#7])c1-c1ccc(-[#7]-[#6]-c2ccc(cc2)S([#6])(=O)=O)cc1