Reaction Details
TargetProstaglandin E2 receptor EP4 subtype
LigandBDBM50181289
Substrate/Competitorn/a
Meas. Tech.ChEMBL_345142 (CHEMBL869627)
IC50 17±n/a nM
Citation Cameron, KOLefker, BAChu-Moyer, MYCrawford, DTJardine, PDDeNinno, SLGilbert, SGrasser, WAKe, HLu, BOwen, TAParalkar, VMQi, HScott, DOThompson, DDTjoa, CMZawistoski, MP Discovery of highly selective EP4 receptor agonists that stimulate new bone formation and restore bone mass in ovariectomized rats. Bioorg Med Chem Lett16:1799-802 (2006) 
 
Prostaglandin E2 receptor EP4 subtype
Name:Prostaglandin E2 receptor EP4 subtype
Type:PROTEIN
Mol. Mass.:53381.95
Organism:Rattus norvegicus
Description:ChEMBL_1290039
Residue:488
BDBM50181289
NameBDBM50181289
Synonyms:5-(3-((S)-2-(4-(3-fluorophenyl)-3-hydroxybutyl)-5-oxopyrrolidin-1-yl)propyl)thiophene-2-carboxylic acid | CHEMBL378968
TypeSmall organic molecule
Emp. Form.C22H26FNO4S
Mol. Mass.419.51
SMILESOC(CC[C@H]1CCC(=O)N1CCCc1ccc(s1)C(O)=O)Cc1cccc(F)c1