Reaction Details
TargetProstaglandin E2 receptor EP4 subtype
LigandBDBM50181296
Substrate/Competitorn/a
Meas. Tech.ChEMBL_345142 (CHEMBL869627)
IC50 21±n/a nM
Citation Cameron, KOLefker, BAChu-Moyer, MYCrawford, DTJardine, PDDeNinno, SLGilbert, SGrasser, WAKe, HLu, BOwen, TAParalkar, VMQi, HScott, DOThompson, DDTjoa, CMZawistoski, MP Discovery of highly selective EP4 receptor agonists that stimulate new bone formation and restore bone mass in ovariectomized rats. Bioorg Med Chem Lett16:1799-802 (2006) 
 
Prostaglandin E2 receptor EP4 subtype
Name:Prostaglandin E2 receptor EP4 subtype
Type:PROTEIN
Mol. Mass.:53381.95
Organism:Rattus norvegicus
Description:ChEMBL_1290039
Residue:488
BDBM50181296
NameBDBM50181296
Synonyms:5-(3-((S)-2-(3-hydroxy-4-phenylbutyl)-5-oxopyrrolidin-1-yl)propyl)thiophene-2-carboxylic acid | CHEMBL382029
TypeSmall organic molecule
Emp. Form.C22H27NO4S
Mol. Mass.401.519
SMILESOC(CC[C@H]1CCC(=O)N1CCCc1ccc(s1)C(O)=O)Cc1ccccc1