Reaction Details
TargetPlatelet-derived growth factor receptor beta
LigandBDBM50181302
Substrate/Competitorn/a
Meas. Tech.ChEMBL_347373 (CHEMBL865653)
IC50 691±n/a nM
Citation Frazier, KJazan, EMcBride, CMPecchi, SRenhowe, PAShafer, CMTaylor, CBussiere, DHe, MMJansen, JMLapointe, GMa, SVora, JWiesmann, M Design and structure-activity relationship of heterocyclic analogs of 4-amino-3-benzimidazol-2-ylhydroquinolin-2-ones as inhibitors of receptor tyrosine kinases. Bioorg Med Chem Lett16:2247-51 (2006) 
 
Platelet-derived growth factor receptor beta
Name:Platelet-derived growth factor receptor beta
Type:Enzyme
Mol. Mass.:122771.00
Organism:Mus musculus (mouse)
Description:P05622
Residue:1098
BDBM50181302
NameBDBM50181302
Synonyms:4-amino-5-(1H-benzo[d]imidazol-2-yl)thieno[2,3-b]pyridin-6(7H)-one | CHEMBL205406
TypeSmall organic molecule
Emp. Form.C14H10N4OS
Mol. Mass.282.32
SMILESNc1c(-c2nc3ccccc3[nH]2)c(=O)[nH]c2sccc12