Reaction Details
TargetVascular endothelial growth factor receptor 1
LigandBDBM50181308
Substrate/Competitorn/a
Meas. Tech.ChEMBL_347371 (CHEMBL865651)
IC50 3±n/a nM
Citation Frazier, KJazan, EMcBride, CMPecchi, SRenhowe, PAShafer, CMTaylor, CBussiere, DHe, MMJansen, JMLapointe, GMa, SVora, JWiesmann, M Design and structure-activity relationship of heterocyclic analogs of 4-amino-3-benzimidazol-2-ylhydroquinolin-2-ones as inhibitors of receptor tyrosine kinases. Bioorg Med Chem Lett16:2247-51 (2006) 
 
Vascular endothelial growth factor receptor 1
Name:Vascular endothelial growth factor receptor 1
Type:Receptor Tyrosine Kinase
Mol. Mass.:150800.23
Organism:Homo sapiens (Human)
Description:P17948
Residue:1338
BDBM50181308
NameBDBM50181308
Synonyms:4-amino-3-(6-(4-methylpiperazin-1-yl)-1H-benzo[d]imidazol-2-yl)-1,7-naphthyridin-2(1H)-one | CHEMBL205893
TypeSmall organic molecule
Emp. Form.C20H21N7O
Mol. Mass.375.427
SMILESCN1CCN(CC1)c1ccc2nc([nH]c2c1)-c1c(N)c2ccncc2[nH]c1=O