Reaction Details
TargetPlatelet-derived growth factor receptor beta
LigandBDBM50181304
Substrate/Competitorn/a
Meas. Tech.ChEMBL_347373 (CHEMBL865653)
IC50 154±n/a nM
Citation Frazier, KJazan, EMcBride, CMPecchi, SRenhowe, PAShafer, CMTaylor, CBussiere, DHe, MMJansen, JMLapointe, GMa, SVora, JWiesmann, M Design and structure-activity relationship of heterocyclic analogs of 4-amino-3-benzimidazol-2-ylhydroquinolin-2-ones as inhibitors of receptor tyrosine kinases. Bioorg Med Chem Lett16:2247-51 (2006) 
 
Platelet-derived growth factor receptor beta
Name:Platelet-derived growth factor receptor beta
Type:Enzyme
Mol. Mass.:122771.00
Organism:Mus musculus (mouse)
Description:P05622
Residue:1098
BDBM50181304
NameBDBM50181304
Synonyms:7-amino-6-(1H-benzo[d]imidazol-2-yl)-3H-imidazo[4,5-b]pyridin-5(4H)-one | CHEMBL383299
TypeSmall organic molecule
Emp. Form.C13H10N6O
Mol. Mass.266.2581
SMILESNc1c(-c2nc3ccccc3[nH]2)c(=O)[nH]c2nc[nH]c12