Reaction Details
TargetVascular endothelial growth factor receptor 2
LigandBDBM50181306
Substrate/Competitorn/a
Meas. Tech.ChEMBL_347372 (CHEMBL865652)
IC50 57±n/a nM
Citation Frazier, KJazan, EMcBride, CMPecchi, SRenhowe, PAShafer, CMTaylor, CBussiere, DHe, MMJansen, JMLapointe, GMa, SVora, JWiesmann, M Design and structure-activity relationship of heterocyclic analogs of 4-amino-3-benzimidazol-2-ylhydroquinolin-2-ones as inhibitors of receptor tyrosine kinases. Bioorg Med Chem Lett16:2247-51 (2006) 
 
Vascular endothelial growth factor receptor 2
Name:Vascular endothelial growth factor receptor 2
Type:PROTEIN
Mol. Mass.:152506.58
Organism:Mus musculus
Description:ChEMBL_1469997
Residue:1367
BDBM50181306
NameBDBM50181306
Synonyms:4-amino-3-(6-morpholino-1H-benzo[d]imidazol-2-yl)-1,6-naphthyridin-2(1H)-one | CHEMBL381283
TypeSmall organic molecule
Emp. Form.C19H18N6O2
Mol. Mass.362.3852
SMILESNc1c(-c2nc3ccc(cc3[nH]2)N2CCOCC2)c(=O)[nH]c2ccncc12