Reaction Details
TargetVascular endothelial growth factor receptor 2
LigandBDBM50181317
Substrate/Competitorn/a
Meas. Tech.ChEMBL_347372 (CHEMBL865652)
IC50 114±n/a nM
Citation Frazier, KJazan, EMcBride, CMPecchi, SRenhowe, PAShafer, CMTaylor, CBussiere, DHe, MMJansen, JMLapointe, GMa, SVora, JWiesmann, M Design and structure-activity relationship of heterocyclic analogs of 4-amino-3-benzimidazol-2-ylhydroquinolin-2-ones as inhibitors of receptor tyrosine kinases. Bioorg Med Chem Lett16:2247-51 (2006) 
 
Vascular endothelial growth factor receptor 2
Name:Vascular endothelial growth factor receptor 2
Type:PROTEIN
Mol. Mass.:152506.58
Organism:Mus musculus
Description:ChEMBL_1469997
Residue:1367
BDBM50181317
NameBDBM50181317
Synonyms:3-(1H-benzo[d]imidazol-2-yl)-4-hydroxyquinolin-2(1H)-one | CHEMBL377345
TypeSmall organic molecule
Emp. Form.C16H11N3O2
Mol. Mass.277.2774
SMILESOc1c(-c2nc3ccccc3[nH]2)c(=O)[nH]c2ccccc12