Reaction Details
TargetPlatelet-derived growth factor receptor beta
LigandBDBM50181316
Substrate/Competitorn/a
Meas. Tech.ChEMBL_347373 (CHEMBL865653)
IC50 575±n/a nM
Citation Frazier, KJazan, EMcBride, CMPecchi, SRenhowe, PAShafer, CMTaylor, CBussiere, DHe, MMJansen, JMLapointe, GMa, SVora, JWiesmann, M Design and structure-activity relationship of heterocyclic analogs of 4-amino-3-benzimidazol-2-ylhydroquinolin-2-ones as inhibitors of receptor tyrosine kinases. Bioorg Med Chem Lett16:2247-51 (2006) 
 
Platelet-derived growth factor receptor beta
Name:Platelet-derived growth factor receptor beta
Type:Enzyme
Mol. Mass.:122771.00
Organism:Mus musculus (mouse)
Description:P05622
Residue:1098
BDBM50181316
NameBDBM50181316
Synonyms:4-amino-5-(1H-benzo[d]imidazol-2-yl)-1-methyl-1H-pyrazolo[3,4-b]pyridin-6(7H)-one | CHEMBL383261
TypeSmall organic molecule
Emp. Form.C14H12N6O
Mol. Mass.280.2847
SMILESCn1ncc2c(N)c(-c3nc4ccccc4[nH]3)c(=O)[nH]c12