Reaction Details
TargetFibroblast growth factor receptor 1
LigandBDBM50181318
Substrate/Competitorn/a
Meas. Tech.ChEMBL_347374 (CHEMBL865654)
IC50 3170±n/a nM
Citation Frazier, KJazan, EMcBride, CMPecchi, SRenhowe, PAShafer, CMTaylor, CBussiere, DHe, MMJansen, JMLapointe, GMa, SVora, JWiesmann, M Design and structure-activity relationship of heterocyclic analogs of 4-amino-3-benzimidazol-2-ylhydroquinolin-2-ones as inhibitors of receptor tyrosine kinases. Bioorg Med Chem Lett16:2247-51 (2006) 
 
Fibroblast growth factor receptor 1
Name:Fibroblast growth factor receptor 1
Type:Receptor
Mol. Mass.:91861.70
Organism:Homo sapiens (Human)
Description:P11362
Residue:822
BDBM50181318
NameBDBM50181318
Synonyms:4-amino-5-(1H-benzo[d]imidazol-2-yl)-1H-pyrazolo[3,4-b]pyridin-6(7H)-one | CHEMBL205305
TypeSmall organic molecule
Emp. Form.C13H10N6O
Mol. Mass.266.2581
SMILESNc1c(-c2nc3ccccc3[nH]2)c(=O)[nH]c2n[nH]cc12