Reaction Details
TargetPlatelet-derived growth factor receptor beta
LigandBDBM50181314
Substrate/Competitorn/a
Meas. Tech.ChEMBL_347373 (CHEMBL865653)
IC50 25±n/a nM
Citation Frazier, KJazan, EMcBride, CMPecchi, SRenhowe, PAShafer, CMTaylor, CBussiere, DHe, MMJansen, JMLapointe, GMa, SVora, JWiesmann, M Design and structure-activity relationship of heterocyclic analogs of 4-amino-3-benzimidazol-2-ylhydroquinolin-2-ones as inhibitors of receptor tyrosine kinases. Bioorg Med Chem Lett16:2247-51 (2006) 
 
Platelet-derived growth factor receptor beta
Name:Platelet-derived growth factor receptor beta
Type:Enzyme
Mol. Mass.:122771.00
Organism:Mus musculus (mouse)
Description:P05622
Residue:1098
BDBM50181314
NameBDBM50181314
Synonyms:4-amino-3-(3H-imidazo[4,5-b]pyridin-2-yl)quinolin-2(1H)-one | CHEMBL204727
TypeSmall organic molecule
Emp. Form.C15H11N5O
Mol. Mass.277.2807
SMILESNc1c(-c2nc3ncccc3[nH]2)c(=O)[nH]c2ccccc12